Clang Error In Xcode 10

sdsoc_opencv error - FPGA - Digilent Forum

sdsoc_opencv error - FPGA - Digilent Forum

Read more
Quick start - Chat SDK for iOS – Zendesk Develop

Quick start - Chat SDK for iOS – Zendesk Develop

Read more
Static analyzers for Swift and Objective-C - HackerBay

Static analyzers for Swift and Objective-C - HackerBay

Read more
Build an OpenGL ES Application on Android and iOS - Visual

Build an OpenGL ES Application on Android and iOS - Visual

Read more
Xcode File Not Found Header

Xcode File Not Found Header

Read more
Best IDE Software - a List of the Top 10 - KeyCDN

Best IDE Software - a List of the Top 10 - KeyCDN

Read more
What's inside the Derived Data folder? · VojtaStavik com

What's inside the Derived Data folder? · VojtaStavik com

Read more
Automated Static Code Analysis with Xcode 5 1 and Jenkins

Automated Static Code Analysis with Xcode 5 1 and Jenkins

Read more
Mac OS X: Install GCC Compiler with Xcode - nixCraft

Mac OS X: Install GCC Compiler with Xcode - nixCraft

Read more
Upgrading Apps To Xcode 7: linker command failed with exit

Upgrading Apps To Xcode 7: linker command failed with exit

Read more
Building on Mac 10 14 Mojave - Development - 3D Slicer Community

Building on Mac 10 14 Mojave - Development - 3D Slicer Community

Read more
Optimizing Compilation Time for Swift Code - codeburst

Optimizing Compilation Time for Swift Code - codeburst

Read more
Xcode link issue  CURRENT_ARCH not correct - Autodesk

Xcode link issue CURRENT_ARCH not correct - Autodesk

Read more
Xcode organizer permission denied download

Xcode organizer permission denied download

Read more
Error: linker command failed with exit code 1 (use -v to see

Error: linker command failed with exit code 1 (use -v to see

Read more
clang: error: no such file or directory: '__ent    - 简书

clang: error: no such file or directory: '__ent - 简书

Read more
Setting up GitLab CI for iOS projects | GitLab

Setting up GitLab CI for iOS projects | GitLab

Read more
Xcode Clang Error

Xcode Clang Error

Read more
How to install gcc compiler on Mac OS X – Mkyong com

How to install gcc compiler on Mac OS X – Mkyong com

Read more
Quality assurance | SpringerLink

Quality assurance | SpringerLink

Read more
Solved: I Am Working On A Program On Xcode, However, I Hav

Solved: I Am Working On A Program On Xcode, However, I Hav

Read more
0 11 — Configuring your compiler: Warning and error levels

0 11 — Configuring your compiler: Warning and error levels

Read more
Renaming Xcode Project | Treehouse Community

Renaming Xcode Project | Treehouse Community

Read more
Install OpenCV 4 on macOS - PyImageSearch

Install OpenCV 4 on macOS - PyImageSearch

Read more
ld: warning: directory not found for option '-F/Users

ld: warning: directory not found for option '-F/Users

Read more
Clang Error In Xcode 10

Clang Error In Xcode 10

Read more
Object-C运行unit test时报clang: error: linker command failed

Object-C运行unit test时报clang: error: linker command failed

Read more
Xcode Clang Error

Xcode Clang Error

Read more
iOS and Android setup on MacOS - Build Failed when trying to

iOS and Android setup on MacOS - Build Failed when trying to

Read more
clang: error: unknown argument: '-fobjc-gc' - HDK : Houdini

clang: error: unknown argument: '-fobjc-gc' - HDK : Houdini

Read more
Setting Up An SDL2 Project In Xcode 9 | Matthew Styles

Setting Up An SDL2 Project In Xcode 9 | Matthew Styles

Read more
FutureBASIC 6 0 2 Free Download for Mac | MacUpdate

FutureBASIC 6 0 2 Free Download for Mac | MacUpdate

Read more
Dealing with a Swift toolchain

Dealing with a Swift toolchain

Read more
iOS Build Failure - ld: symbol(s) not found for architecture

iOS Build Failure - ld: symbol(s) not found for architecture

Read more
Creating A Program in Xcode - UWB CSS Wiki

Creating A Program in Xcode - UWB CSS Wiki

Read more
C Compiler, Part 10: Global Variables

C Compiler, Part 10: Global Variables

Read more
Xcode Clang Error

Xcode Clang Error

Read more
Migrating Perfect project to Swift 4 - By

Migrating Perfect project to Swift 4 - By

Read more
Unity Xcode Clang Error

Unity Xcode Clang Error

Read more
Xcode Warnings: Turn Them Up to Eleven! • Quality Coding

Xcode Warnings: Turn Them Up to Eleven! • Quality Coding

Read more
reactjs - Xcode: ld: 275 duplicate symbols for architecture

reactjs - Xcode: ld: 275 duplicate symbols for architecture

Read more
Simple C++: From Makefiles to Xcode Builds - Hiltmon

Simple C++: From Makefiles to Xcode Builds - Hiltmon

Read more
Unity Xcode Clang Error

Unity Xcode Clang Error

Read more
Xcode(Swift) + CocoaPodsでgRPCのClientを生成してServiceを

Xcode(Swift) + CocoaPodsでgRPCのClientを生成してServiceを

Read more
Switching Swift Versions inside Xcode using Toolchains – XCBLOG

Switching Swift Versions inside Xcode using Toolchains – XCBLOG

Read more
Qt is not compiling the project on mac OS | Qt Forum

Qt is not compiling the project on mac OS | Qt Forum

Read more
Cordova SDK Setup

Cordova SDK Setup

Read more
How to Install the Command Line Developer Tools Without

How to Install the Command Line Developer Tools Without

Read more
Behind the Scenes of the Xcode Build Process - WWDC 2018

Behind the Scenes of the Xcode Build Process - WWDC 2018

Read more
Improving Your Build Time in Xcode 10 · Patrick Balestra

Improving Your Build Time in Xcode 10 · Patrick Balestra

Read more
How to Deploy your App on an iPhone (Updated for 2019)

How to Deploy your App on an iPhone (Updated for 2019)

Read more
iOS Deployment Target issue - iOS SDK version not available

iOS Deployment Target issue - iOS SDK version not available

Read more
Clang Error In Xcode 10

Clang Error In Xcode 10

Read more
Undefined symbols for architecture i386: “_OBJC_CLASS_$_

Undefined symbols for architecture i386: “_OBJC_CLASS_$_

Read more
How to install Xcode, Homebrew, Git, RVM, Ruby & Rails on

How to install Xcode, Homebrew, Git, RVM, Ruby & Rails on

Read more
Xcode could not resolve type from dSYM if build folder is

Xcode could not resolve type from dSYM if build folder is

Read more
Planet Clang

Planet Clang

Read more
基于LLVM开发Clang插件进行代码风格检查- CocoaChina_一站式开发

基于LLVM开发Clang插件进行代码风格检查- CocoaChina_一站式开发

Read more
Silencing Specific Build Warnings | Dave DeLong

Silencing Specific Build Warnings | Dave DeLong

Read more
Article: Framework not found KonyLogger, clang: warning

Article: Framework not found KonyLogger, clang: warning

Read more
Xcode Warnings: Turn Them Up to Eleven! • Quality Coding

Xcode Warnings: Turn Them Up to Eleven! • Quality Coding

Read more
iOS package Undefined symbols for architecture armv7 - UE4

iOS package Undefined symbols for architecture armv7 - UE4

Read more
Unity Lessons - Xcode - How to Fix Mach-O Linker Errors when Building in  Xcode from Unity

Unity Lessons - Xcode - How to Fix Mach-O Linker Errors when Building in Xcode from Unity

Read more
Mastering App Development with Xcode Targets

Mastering App Development with Xcode Targets

Read more
library not found for -lGoogleToolboxForMac - Digital App

library not found for -lGoogleToolboxForMac - Digital App

Read more
Planet Clang

Planet Clang

Read more
Titanium and Xcode 4 3: Revisited

Titanium and Xcode 4 3: Revisited

Read more
Improving Your Build Time in Xcode 10 · Patrick Balestra

Improving Your Build Time in Xcode 10 · Patrick Balestra

Read more
FAQ · Kiwisec

FAQ · Kiwisec

Read more
FutureBASIC 6 0 2 Free Download for Mac | MacUpdate

FutureBASIC 6 0 2 Free Download for Mac | MacUpdate

Read more
Xcode Linker Command Failed With Exit Code 1

Xcode Linker Command Failed With Exit Code 1

Read more
Mastering App Development with Xcode Targets

Mastering App Development with Xcode Targets

Read more
Apple Mach-O Linker Error Xcode, Unity3D Warnings: Solved

Apple Mach-O Linker Error Xcode, Unity3D Warnings: Solved

Read more
Xcode build settings tour – martinmitrevski

Xcode build settings tour – martinmitrevski

Read more
Updated to Mojave – Drifting Ruby

Updated to Mojave – Drifting Ruby

Read more
0 11 — Configuring your compiler: Warning and error levels

0 11 — Configuring your compiler: Warning and error levels

Read more
Clang - Wikipedia

Clang - Wikipedia

Read more
Unable to change the PRODUCT_NAME in XCode

Unable to change the PRODUCT_NAME in XCode

Read more
ARKit and Unity - blog

ARKit and Unity - blog

Read more
scan-build: running the analyzer from the command line

scan-build: running the analyzer from the command line

Read more
Creating and Distributing an iOS Binary Framework | Instabug

Creating and Distributing an iOS Binary Framework | Instabug

Read more
Improving Your Build Time in Xcode 10 · Patrick Balestra

Improving Your Build Time in Xcode 10 · Patrick Balestra

Read more
How to Deploy your App on an iPhone (Updated for 2019)

How to Deploy your App on an iPhone (Updated for 2019)

Read more
has iOS-strange error when testing on simulator : Code Examples

has iOS-strange error when testing on simulator : Code Examples

Read more
Help with brms error - General - Stan

Help with brms error - General - Stan

Read more
Xcode error ld: framework not found AudioUnit clang: error

Xcode error ld: framework not found AudioUnit clang: error

Read more
Xcode Linker Command Failed With Exit Code 1

Xcode Linker Command Failed With Exit Code 1

Read more
Xcode Linker Command Failed With Exit Code 1

Xcode Linker Command Failed With Exit Code 1

Read more
ARC and Memory Management in Swift | raywenderlich com

ARC and Memory Management in Swift | raywenderlich com

Read more
Xcode 10 ERROR:

Xcode 10 ERROR:" [CP] Cop

Read more
Install Code Blocks on Mac OS X and run your first C program

Install Code Blocks on Mac OS X and run your first C program

Read more
Creating and Distributing an iOS Binary Framework | Instabug

Creating and Distributing an iOS Binary Framework | Instabug

Read more
HOWTO: Setup XCode 6 1 to work with OpenCV3 libraries

HOWTO: Setup XCode 6 1 to work with OpenCV3 libraries

Read more
ld: 411 duplicate symbols for architecture arm64 clang

ld: 411 duplicate symbols for architecture arm64 clang

Read more
It Looks Like You Are Trying to Use a Framework - Digital

It Looks Like You Are Trying to Use a Framework - Digital

Read more
Compilation speed: help test batch mode! - Compiler - Swift

Compilation speed: help test batch mode! - Compiler - Swift

Read more
Enable bitcode for Frameworks in Xcode - English Only - iOSRE

Enable bitcode for Frameworks in Xcode - English Only - iOSRE

Read more
Compile C++ with the LLVM compiler

Compile C++ with the LLVM compiler

Read more
SOLVED] Fix Apple Mach-O Linker Error in Simple Steps

SOLVED] Fix Apple Mach-O Linker Error in Simple Steps

Read more
macos - Can't update Developer Tools on Mojave - Ask Different

macos - Can't update Developer Tools on Mojave - Ask Different

Read more